Reaction Details
TargetMast/stem cell growth factor receptor Kit
LigandBDBM50215774
Substrate/Competitorn/a
Meas. Tech.ChEMBL_456549 (CHEMBL922915)
IC50 3±n/a nM
Citation Wickens, PKluender, HDixon, JBrennan, CAchebe, FBacchiocchi, ABankston, DBierer, DBrands, MBraun, DBrown, MSChuang, CYDumas, JEnyedy, IHofilena, GHong, ZHousley, TJones, BKhire, UKreiman, CKumarasinghe, ELowinger, TOtt-Morgan, RPerkins, LPhillips, BSchoenleber, RScott, WJSheeler, RRedman, ASun, XTaylor, IWang, LWilhelm, SZhang, XZhang, MSullivan, ECarter, CMiglarese, MLevy, J SAR of a novel 'Anthranilamide Like' series of VEGFR-2, multi protein kinase inhibitors for the treatment of cancer. Bioorg Med Chem Lett17:4378-81 (2007) 
 
Mast/stem cell growth factor receptor Kit
Name:Mast/stem cell growth factor receptor Kit
Type:Protein
Mol. Mass.:109869.37
Organism:Homo sapiens (Human)
Description:P10721
Residue:976
BDBM50215774
NameBDBM50215774
Synonyms:CHEMBL246424 | N-(2,2-difluorobenzo[d][1,3]dioxol-5-yl)-2-((2-(methylamino)pyrimidin-4-yl)methylamino)benzamide
TypeSmall organic molecule
Emp. Form.C20H17F2N5O3
Mol. Mass.413.3775
SMILESCNc1nccc(CNc2ccccc2C(=O)Nc2ccc3OC(F)(F)Oc3c2)n1