Reaction Details
TargetMast/stem cell growth factor receptor Kit
LigandBDBM50215799
Substrate/Competitorn/a
Meas. Tech.ChEMBL_456549 (CHEMBL922915)
IC50 23±n/a nM
Citation Wickens, PKluender, HDixon, JBrennan, CAchebe, FBacchiocchi, ABankston, DBierer, DBrands, MBraun, DBrown, MSChuang, CYDumas, JEnyedy, IHofilena, GHong, ZHousley, TJones, BKhire, UKreiman, CKumarasinghe, ELowinger, TOtt-Morgan, RPerkins, LPhillips, BSchoenleber, RScott, WJSheeler, RRedman, ASun, XTaylor, IWang, LWilhelm, SZhang, XZhang, MSullivan, ECarter, CMiglarese, MLevy, J SAR of a novel 'Anthranilamide Like' series of VEGFR-2, multi protein kinase inhibitors for the treatment of cancer. Bioorg Med Chem Lett17:4378-81 (2007) 
 
Mast/stem cell growth factor receptor Kit
Name:Mast/stem cell growth factor receptor Kit
Type:Protein
Mol. Mass.:109869.37
Organism:Homo sapiens (Human)
Description:P10721
Residue:976
BDBM50215799
NameBDBM50215799
Synonyms:2-((2-(2-(1H-imidazol-5-yl)ethylamino)pyridin-4-yl)methylamino)-N-(2,2-difluorobenzo[d][1,3]dioxol-5-yl)benzamide | CHEMBL247792
TypeSmall organic molecule
Emp. Form.C25H22F2N6O3
Mol. Mass.492.4774
SMILESFC1(F)Oc2ccc(NC(=O)c3ccccc3NCc3ccnc(NCCc4cnc[nH]4)c3)cc2O1