Reaction Details
TargetMelanocortin receptor 4
LigandBDBM50215835
Substrate/Competitorn/a
Meas. Tech.ChEMBL_447747 (CHEMBL895641)
Ki 6.5±n/a nM
Citation Poitout, LBrault, VSackur, CBernetière, SCamara, JPlas, PRoubert, P Identification of a novel series of benzimidazoles as potent and selective antagonists of the human melanocortin-4 receptor. Bioorg Med Chem Lett17:4464-70 (2007) 
 
Melanocortin receptor 4
Name:Melanocortin receptor 4
Type:Enzyme
Mol. Mass.:36949.50
Organism:Homo sapiens (Human)
Description:P32245
Residue:332
BDBM50215835
NameBDBM50215835
Synonyms:2-(4-carbamoylphenylamino)-N,N-diisopentyl-3-(3-(piperidin-1-yl)propyl)-3H-benzo[d]imidazole-5-carboxamide | CHEMBL232164
TypeSmall organic molecule
Emp. Form.C33H48N6O2
Mol. Mass.560.7732
SMILESCC(C)CCN(CCC(C)C)C(=O)c1ccc2nc(Nc3ccc(cc3)C(N)=O)n(CCCN3CCCCC3)c2c1