Reaction Details
TargetMelanocortin receptor 4
LigandBDBM50215828
Substrate/Competitorn/a
Meas. Tech.ChEMBL_447747 (CHEMBL895641)
Ki 3.3±n/a nM
Citation Poitout, LBrault, VSackur, CBernetière, SCamara, JPlas, PRoubert, P Identification of a novel series of benzimidazoles as potent and selective antagonists of the human melanocortin-4 receptor. Bioorg Med Chem Lett17:4464-70 (2007) 
 
Melanocortin receptor 4
Name:Melanocortin receptor 4
Type:Enzyme
Mol. Mass.:36949.50
Organism:Homo sapiens (Human)
Description:P32245
Residue:332
BDBM50215828
NameBDBM50215828
Synonyms:CHEMBL233758 | N,N-diisopentyl-2-(4-(methylcarbamoyl)phenylamino)-3-(3-(piperidin-1-yl)propyl)-3H-benzo[d]imidazole-5-carboxamide
TypeSmall organic molecule
Emp. Form.C34H50N6O2
Mol. Mass.574.7998
SMILESCNC(=O)c1ccc(Nc2nc3ccc(cc3n2CCCN2CCCCC2)C(=O)N(CCC(C)C)CCC(C)C)cc1