Reaction Details
TargetMelanocortin receptor 4
LigandBDBM50215801
Substrate/Competitorn/a
Meas. Tech.ChEMBL_447747 (CHEMBL895641)
Ki 3.2±n/a nM
Citation Poitout, LBrault, VSackur, CBernetière, SCamara, JPlas, PRoubert, P Identification of a novel series of benzimidazoles as potent and selective antagonists of the human melanocortin-4 receptor. Bioorg Med Chem Lett17:4464-70 (2007) 
 
Melanocortin receptor 4
Name:Melanocortin receptor 4
Type:Enzyme
Mol. Mass.:36949.50
Organism:Homo sapiens (Human)
Description:P32245
Residue:332
BDBM50215801
NameBDBM50215801
Synonyms:CHEMBL391664 | N,N-diisopentyl-2-(1-methyl-1H-indol-3-yl)-3-(3-(piperidin-1-yl)propyl)-3H-benzo[d]imidazole-5-carboxamide
TypeSmall organic molecule
Emp. Form.C35H49N5O
Mol. Mass.555.7965
SMILESCC(C)CCN(CCC(C)C)C(=O)c1ccc2nc(-c3cn(C)c4ccccc34)n(CCCN3CCCCC3)c2c1