Reaction Details
TargetMelanocortin receptor 4
LigandBDBM50215829
Substrate/Competitorn/a
Meas. Tech.ChEMBL_447747 (CHEMBL895641)
Ki 7.6±n/a nM
Citation Poitout, LBrault, VSackur, CBernetière, SCamara, JPlas, PRoubert, P Identification of a novel series of benzimidazoles as potent and selective antagonists of the human melanocortin-4 receptor. Bioorg Med Chem Lett17:4464-70 (2007) 
 
Melanocortin receptor 4
Name:Melanocortin receptor 4
Type:Enzyme
Mol. Mass.:36949.50
Organism:Homo sapiens (Human)
Description:P32245
Residue:332
BDBM50215829
NameBDBM50215829
Synonyms:2-(4-bromophenylamino)-N,N-diisopentyl-3-(3-(piperidin-1-yl)propyl)-3H-benzo[d]imidazole-5-carboxamide | CHEMBL232387
TypeSmall organic molecule
Emp. Form.C32H46BrN5O
Mol. Mass.596.645
SMILESCC(C)CCN(CCC(C)C)C(=O)c1ccc2nc(Nc3ccc(Br)cc3)n(CCCN3CCCCC3)c2c1