Reaction Details
TargetMelanocortin receptor 4
LigandBDBM50215805
Substrate/Competitorn/a
Meas. Tech.ChEMBL_447747 (CHEMBL895641)
Ki 4.9±n/a nM
Citation Poitout, LBrault, VSackur, CBernetière, SCamara, JPlas, PRoubert, P Identification of a novel series of benzimidazoles as potent and selective antagonists of the human melanocortin-4 receptor. Bioorg Med Chem Lett17:4464-70 (2007) 
 
Melanocortin receptor 4
Name:Melanocortin receptor 4
Type:Enzyme
Mol. Mass.:36949.50
Organism:Homo sapiens (Human)
Description:P32245
Residue:332
BDBM50215805
NameBDBM50215805
Synonyms:2-(4-acetylphenylamino)-N,N-diisopentyl-3-(3-(pyrrolidin-1-yl)propyl)-3H-benzo[d]imidazole-5-carboxamide | CHEMBL439020
TypeSmall organic molecule
Emp. Form.C33H47N5O2
Mol. Mass.545.7586
SMILESCC(C)CCN(CCC(C)C)C(=O)c1ccc2nc(Nc3ccc(cc3)C(C)=O)n(CCCN3CCCC3)c2c1