Reaction Details
TargetMelanocortin receptor 4
LigandBDBM50215852
Substrate/Competitorn/a
Meas. Tech.ChEMBL_447747 (CHEMBL895641)
Ki 8.3±n/a nM
Citation Poitout, LBrault, VSackur, CBernetière, SCamara, JPlas, PRoubert, P Identification of a novel series of benzimidazoles as potent and selective antagonists of the human melanocortin-4 receptor. Bioorg Med Chem Lett17:4464-70 (2007) 
 
Melanocortin receptor 4
Name:Melanocortin receptor 4
Type:Enzyme
Mol. Mass.:36949.50
Organism:Homo sapiens (Human)
Description:P32245
Residue:332
BDBM50215852
NameBDBM50215852
Synonyms:2-(4-fluorophenylamino)-N,N-diisopentyl-3-(3-(piperidin-1-yl)propyl)-3H-benzo[d]imidazole-5-carboxamide | CHEMBL232186
TypeSmall organic molecule
Emp. Form.C32H46FN5O
Mol. Mass.535.7389
SMILESCC(C)CCN(CCC(C)C)C(=O)c1ccc2nc(Nc3ccc(F)cc3)n(CCCN3CCCCC3)c2c1