Reaction Details
TargetMembrane-bound transcription factor site-1 protease
LigandBDBM50216183
Substrate/Competitorn/a
Meas. Tech.ChEMBL_447771 (CHEMBL896780)
IC50 590±n/a nM
Citation Hay, BAAbrams, BZumbrunn, AYValentine, JJWarren, LCPetras, SFShelly, LDXia, AVarghese, AHHawkins, JLVan Camp, JARobbins, MDLandschulz, KHarwood, HJ Aminopyrrolidineamide inhibitors of site-1 protease. Bioorg Med Chem Lett17:4411-4 (2007) 
 
Membrane-bound transcription factor site-1 protease
Name:Membrane-bound transcription factor site-1 protease
Type:PROTEIN
Mol. Mass.:117773.36
Organism:Homo sapiens (Human)
Description:ChEMBL_641529
Residue:1052
BDBM50216183
NameBDBM50216183
Synonyms:CHEMBL233573 | N-(2-chlorophenethyl)-4-(benzyloxy)-N-(pyrrolidin-3-yl)benzamide
TypeSmall organic molecule
Emp. Form.C26H27ClN2O2
Mol. Mass.434.958
SMILESClc1ccccc1CCN(C1CCNC1)C(=O)c1ccc(OCc2ccccc2)cc1