Reaction Details
TargetMembrane-bound transcription factor site-1 protease
LigandBDBM50216186
Substrate/Competitorn/a
Meas. Tech.ChEMBL_447771 (CHEMBL896780)
IC50 1400±n/a nM
Citation Hay, BAAbrams, BZumbrunn, AYValentine, JJWarren, LCPetras, SFShelly, LDXia, AVarghese, AHHawkins, JLVan Camp, JARobbins, MDLandschulz, KHarwood, HJ Aminopyrrolidineamide inhibitors of site-1 protease. Bioorg Med Chem Lett17:4411-4 (2007) 
 
Membrane-bound transcription factor site-1 protease
Name:Membrane-bound transcription factor site-1 protease
Type:PROTEIN
Mol. Mass.:117773.36
Organism:Homo sapiens (Human)
Description:ChEMBL_641529
Residue:1052
BDBM50216186
NameBDBM50216186
Synonyms:CHEMBL232577 | N-(2-chlorophenethyl)-4-isopropoxy-N-(pyrrolidin-3-yl)benzamide
TypeSmall organic molecule
Emp. Form.C22H27ClN2O2
Mol. Mass.386.915
SMILESCC(C)Oc1ccc(cc1)C(=O)N(CCc1ccccc1Cl)C1CCNC1