Reaction Details
TargetMembrane-bound transcription factor site-1 protease
LigandBDBM50216181
Substrate/Competitorn/a
Meas. Tech.ChEMBL_447771 (CHEMBL896780)
IC50 170±n/a nM
Citation Hay, BAAbrams, BZumbrunn, AYValentine, JJWarren, LCPetras, SFShelly, LDXia, AVarghese, AHHawkins, JLVan Camp, JARobbins, MDLandschulz, KHarwood, HJ Aminopyrrolidineamide inhibitors of site-1 protease. Bioorg Med Chem Lett17:4411-4 (2007) 
 
Membrane-bound transcription factor site-1 protease
Name:Membrane-bound transcription factor site-1 protease
Type:PROTEIN
Mol. Mass.:117773.36
Organism:Homo sapiens (Human)
Description:ChEMBL_641529
Residue:1052
BDBM50216181
NameBDBM50216181
Synonyms:(R)-N-(2-methoxyphenethyl)-4-((diethylamino)methyl)-N-(pyrrolidin-3-yl)benzamide PF-429242
TypeSmall organic molecule
Emp. Form.C25H35N3O2
Mol. Mass.409.5643
SMILESCCN(CC)Cc1ccc(cc1)C(=O)N(CCc1ccccc1OC)[C@@H]1CCNC1