Reaction Details
TargetMembrane-bound transcription factor site-1 protease
LigandBDBM50216187
Substrate/Competitorn/a
Meas. Tech.ChEMBL_447771 (CHEMBL896780)
IC50 510±n/a nM
Citation Hay, BAAbrams, BZumbrunn, AYValentine, JJWarren, LCPetras, SFShelly, LDXia, AVarghese, AHHawkins, JLVan Camp, JARobbins, MDLandschulz, KHarwood, HJ Aminopyrrolidineamide inhibitors of site-1 protease. Bioorg Med Chem Lett17:4411-4 (2007) 
 
Membrane-bound transcription factor site-1 protease
Name:Membrane-bound transcription factor site-1 protease
Type:PROTEIN
Mol. Mass.:117773.36
Organism:Homo sapiens (Human)
Description:ChEMBL_641529
Residue:1052
BDBM50216187
NameBDBM50216187
Synonyms:CHEMBL232777 | N-(3-chlorophenethyl)-4-(benzyloxy)-N-(pyrrolidin-3-yl)benzamide
TypeSmall organic molecule
Emp. Form.C26H27ClN2O2
Mol. Mass.434.958
SMILESClc1cccc(CCN(C2CCNC2)C(=O)c2ccc(OCc3ccccc3)cc2)c1