Reaction Details
TargetMembrane-bound transcription factor site-1 protease
LigandBDBM50216192
Substrate/Competitorn/a
Meas. Tech.ChEMBL_447771 (CHEMBL896780)
IC50>30000±n/a nM
Citation Hay, BAAbrams, BZumbrunn, AYValentine, JJWarren, LCPetras, SFShelly, LDXia, AVarghese, AHHawkins, JLVan Camp, JARobbins, MDLandschulz, KHarwood, HJ Aminopyrrolidineamide inhibitors of site-1 protease. Bioorg Med Chem Lett17:4411-4 (2007) 
 
Membrane-bound transcription factor site-1 protease
Name:Membrane-bound transcription factor site-1 protease
Type:PROTEIN
Mol. Mass.:117773.36
Organism:Homo sapiens (Human)
Description:ChEMBL_641529
Residue:1052
BDBM50216192
NameBDBM50216192
Synonyms:CHEMBL233607 | N-(2-chlorophenethyl)-N-(azetidin-3-yl)-4-isopropoxybenzamide
TypeSmall organic molecule
Emp. Form.C21H25ClN2O2
Mol. Mass.372.888
SMILESCC(C)Oc1ccc(cc1)C(=O)N(CCc1ccccc1Cl)C1CNC1