Reaction Details
TargetMembrane-bound transcription factor site-1 protease
LigandBDBM50216194
Substrate/Competitorn/a
Meas. Tech.ChEMBL_447771 (CHEMBL896780)
IC50 8±n/a nM
Citation Hay, BAAbrams, BZumbrunn, AYValentine, JJWarren, LCPetras, SFShelly, LDXia, AVarghese, AHHawkins, JLVan Camp, JARobbins, MDLandschulz, KHarwood, HJ Aminopyrrolidineamide inhibitors of site-1 protease. Bioorg Med Chem Lett17:4411-4 (2007) 
 
Membrane-bound transcription factor site-1 protease
Name:Membrane-bound transcription factor site-1 protease
Type:PROTEIN
Mol. Mass.:117773.36
Organism:Homo sapiens (Human)
Description:ChEMBL_641529
Residue:1052
BDBM50216194
NameBDBM50216194
Synonyms:CHEMBL391935 | N-(2-chlorophenethyl)-N-(pyrrolidin-3-yl)-4-((3-o-tolylpiperidin-1-yl)methyl)benzamide
TypeSmall organic molecule
Emp. Form.C32H38ClN3O
Mol. Mass.516.117
SMILESCc1ccccc1C1CCCN(Cc2ccc(cc2)C(=O)N(CCc2ccccc2Cl)C2CCNC2)C1