Reaction Details
TargetSodium-dependent serotonin transporter
LigandBDBM50216252
Substrate/Competitorn/a
Meas. Tech.ChEMBL_456605 (CHEMBL923982)
Ki 2.7±n/a nM
Citation Keith, JMGomez, LABarbier, AJWilson, SJBoggs, JDLord, BMazur, CAluisio, LLovenberg, TWCarruthers, NI Pyrrolidino-tetrahydroisoquinolines bearing pendant heterocycles as potent dual H3 antagonist and serotonin transporter inhibitors. Bioorg Med Chem Lett17:4374-7 (2007) 
 
Sodium-dependent serotonin transporter
Name:Sodium-dependent serotonin transporter
Type:Multi-pass membrane protein
Mol. Mass.:70322.51
Organism:Homo sapiens (Human)
Description:P31645
Residue:630
BDBM50216252
NameBDBM50216252
Synonyms:(6S,10bR)-9-(3-(piperidin-1-yl)propoxy)-6-(thiophen-2-yl)-1,2,3,5,6,10b-hexahydropyrrolo[2,1-a]isoquinoline | CHEMBL246716
TypeSmall organic molecule
Emp. Form.C24H32N2OS
Mol. Mass.396.589
SMILESC(COc1ccc2[C@@H](CN3CCC[C@@H]3c2c1)c1cccs1)CN1CCCCC1