Reaction Details
TargetPutative sugar transporter
LigandBDBM50216470
Substrate/Competitorn/a
Meas. Tech.ChEMBL_456666 (CHEMBL924047)
Ki>500000±n/a nM
Citation Ionita, MKrishna, SLéo, PMMorin, CPatel, AP Interaction of O-(undec-10-en)-yl-D-glucose derivatives with the Plasmodium falciparum hexose transporter (PfHT). Bioorg Med Chem Lett17:4934-7 (2007) 
 
Putative sugar transporter
Name:Putative sugar transporter
Synonyms:Hexose transporter 1
Type:PROTEIN
Mol. Mass.:56427.07
Organism:Plasmodium falciparum
Description:ChEMBL_456666
Residue:504
BDBM50216470
NameBDBM50216470
TypeSmall organic molecule
Emp. Form.C17H32O6
Mol. Mass.332.4324
SMILESOC[C@@H](O)[C@H]1O[C@H](OCCCCCCCCCC=C)[C@H](O)[C@H]1O