Reaction Details
TargetGlucocorticoid receptor
LigandBDBM50216489
Substrate/Competitorn/a
Meas. Tech.ChEMBL_440116 (CHEMBL890428)
Ki 20±n/a nM
Citation Ray, NCClark, RDClark, DEWilliams, KHickin, HGCrackett, PHDyke, HJLockey, PMWong, MDevos, RWhite, ABelanoff, JK Discovery and optimization of novel, non-steroidal glucocorticoid receptor modulators. Bioorg Med Chem Lett17:4901-5 (2007) 
 
Glucocorticoid receptor
Name:Glucocorticoid receptor
Type:Enzyme
Mol. Mass.:85656.87
Organism:Homo sapiens (Human)
Description:P04150
Residue:777
BDBM50216489
NameBDBM50216489
Synonyms:5-benzyl-3-methyl-6-(4-phenylpiperidin-1-yl)pyrimidine-2,4(1H,3H)-dione | CHEMBL438667
TypeSmall organic molecule
Emp. Form.C23H25N3O2
Mol. Mass.375.4635
SMILESCn1c(=O)[nH]c(N2CCC(CC2)c2ccccc2)c(Cc2ccccc2)c1=O