Reaction Details
TargetGlucocorticoid receptor
LigandBDBM50216476
Substrate/Competitorn/a
Meas. Tech.ChEMBL_440116 (CHEMBL890428)
Ki 16±n/a nM
Citation Ray, NCClark, RDClark, DEWilliams, KHickin, HGCrackett, PHDyke, HJLockey, PMWong, MDevos, RWhite, ABelanoff, JK Discovery and optimization of novel, non-steroidal glucocorticoid receptor modulators. Bioorg Med Chem Lett17:4901-5 (2007) 
 
Glucocorticoid receptor
Name:Glucocorticoid receptor
Type:Enzyme
Mol. Mass.:85656.87
Organism:Homo sapiens (Human)
Description:P04150
Residue:777
BDBM50216476
NameBDBM50216476
Synonyms:5-(3-chlorobenzyl)-6-(4-benzylpiperidin-1-yl)-3-methylpyrimidine-2,4(1H,3H)-dione | CHEMBL230030
TypeSmall organic molecule
Emp. Form.C24H26ClN3O2
Mol. Mass.423.935
SMILESCn1c(=O)[nH]c(N2CCC(Cc3ccccc3)CC2)c(Cc2cccc(Cl)c2)c1=O