Reaction Details
TargetKinesin-like protein KIF11
LigandBDBM50216502
Substrate/Competitorn/a
Meas. Tech.ChEMBL_448481 (CHEMBL897635)
IC50 12300±n/a nM
Citation Klein, EDeBonis, SThiede, BSkoufias, DAKozielski, FLebeau, L New chemical tools for investigating human mitotic kinesin Eg5. Bioorg Med Chem15:6474-88 (2007) 
 
Kinesin-like protein KIF11
Name:Kinesin-like protein KIF11
Type:PROTEIN
Mol. Mass.:119138.97
Organism:Homo sapiens (Human)
Description:ChEMBL_1457426
Residue:1056
BDBM50216502
NameBDBM50216502
Synonyms:4-(3-hydroxy-phenyl)-6-methyl-2-thioxo-1,2,3,4-tetrahydro-pyrimidine-5-carboxylic acid ethyl ester monastrol | rac-monastrol
TypeSmall organic molecule
Emp. Form.C14H16N2O3S
Mol. Mass.292.353
SMILESCCOC(=O)C1C(NC(=S)N=C1C)c1cccc(O)c1