Reaction Details
TargetHydroxycarboxylic acid receptor 2
LigandBDBM50132135
Substrate/Competitorn/a
Meas. Tech.ChEMBL_456679 (CHEMBL924060)
EC50 2700±n/a nM
Citation Gharbaoui, TSkinner, PJShin, YJAverbuj, CJung, JKJohnson, BRDuong, TDecaire, MUy, JCherrier, MCWebb, PJTamura, SYZou, NRodriguez, NBoatman, PDSage, CRLindstrom, AXu, JSchrader, TOSmith, BMChen, RRichman, JGConnolly, DTColletti, SLTata, JRSemple, G Agonist lead identification for the high affinity niacin receptor GPR109a. Bioorg Med Chem Lett17:4914-9 (2007) 
 
Hydroxycarboxylic acid receptor 2
Name:Hydroxycarboxylic acid receptor 2
Type:G Protein-Coupled Receptor (GPCR)
Mol. Mass.:41868.22
Organism:Homo sapiens (Human)
Description:Membranes from CHO cells expressing the recombinant human GPR109A were used in competition binding assay.
Residue:363
BDBM50132135
NameBDBM50132135
Synonyms:4,6-Dihydro-1H-furo[3,4-c]pyrazole-3-carboxylic acid CHEMBL338071
TypeSmall organic molecule
Emp. Form.C6H6N2O3
Mol. Mass.154.1234
SMILESOC(=O)c1[nH]nc2COCc12