Reaction Details
TargetHydroxycarboxylic acid receptor 2
LigandBDBM50211363
Substrate/Competitorn/a
Meas. Tech.ChEMBL_456679 (CHEMBL924060)
EC50 8300±n/a nM
Citation Gharbaoui, TSkinner, PJShin, YJAverbuj, CJung, JKJohnson, BRDuong, TDecaire, MUy, JCherrier, MCWebb, PJTamura, SYZou, NRodriguez, NBoatman, PDSage, CRLindstrom, AXu, JSchrader, TOSmith, BMChen, RRichman, JGConnolly, DTColletti, SLTata, JRSemple, G Agonist lead identification for the high affinity niacin receptor GPR109a. Bioorg Med Chem Lett17:4914-9 (2007) 
 
Hydroxycarboxylic acid receptor 2
Name:Hydroxycarboxylic acid receptor 2
Type:G Protein-Coupled Receptor (GPCR)
Mol. Mass.:41868.22
Organism:Homo sapiens (Human)
Description:Membranes from CHO cells expressing the recombinant human GPR109A were used in competition binding assay.
Residue:363
BDBM50211363
NameBDBM50211363
Synonyms:3-isopropyl-1H-pyrazole-5-carboxylic acid 5-isopropyl-3-carboxyl-pyrazole | CHEMBL238002
TypeSmall organic molecule
Emp. Form.C7H10N2O2
Mol. Mass.154.1665
SMILESCC(C)c1cc(n[nH]1)C(O)=O