Reaction Details
TargetHydroxycarboxylic acid receptor 2
LigandBDBM50132140
Substrate/Competitorn/a
Meas. Tech.ChEMBL_456679 (CHEMBL924060)
EC50 860±n/a nM
Citation Gharbaoui, TSkinner, PJShin, YJAverbuj, CJung, JKJohnson, BRDuong, TDecaire, MUy, JCherrier, MCWebb, PJTamura, SYZou, NRodriguez, NBoatman, PDSage, CRLindstrom, AXu, JSchrader, TOSmith, BMChen, RRichman, JGConnolly, DTColletti, SLTata, JRSemple, G Agonist lead identification for the high affinity niacin receptor GPR109a. Bioorg Med Chem Lett17:4914-9 (2007) 
 
Hydroxycarboxylic acid receptor 2
Name:Hydroxycarboxylic acid receptor 2
Type:G Protein-Coupled Receptor (GPCR)
Mol. Mass.:41868.22
Organism:Homo sapiens (Human)
Description:Membranes from CHO cells expressing the recombinant human GPR109A were used in competition binding assay.
Residue:363
BDBM50132140
NameBDBM50132140
Synonyms:1,4,5,6-Tetrahydro-cyclopentapyrazole-3-carboxylic acid 2,4,5,6-tetrahydrocyclopenta[c]pyrazole-3-carboxylate CHEMBL128604
TypeSmall organic molecule
Emp. Form.C7H8N2O2
Mol. Mass.152.1506
SMILESOC(=O)c1n[nH]c2CCCc12