Reaction Details
TargetSodium channel protein type 9 subunit alpha
LigandBDBM50216644
Substrate/Competitorn/a
Meas. Tech.ChEMBL_456687 (CHEMBL924068)
IC50 44±n/a nM
Citation Hoyt, SBLondon, CGorin, DWyvratt, MJFisher, MHAbbadie, CFelix, JPGarcia, MLLi, XLyons, KAMcGowan, EMacIntyre, DEMartin, WJPriest, BTRitter, ASmith, MMWarren, VAWilliams, BSKaczorowski, GJParsons, WH Discovery of a novel class of benzazepinone Na(v)1.7 blockers: potential treatments for neuropathic pain. Bioorg Med Chem Lett17:4630-4 (2007) 
 
Sodium channel protein type 9 subunit alpha
Name:Sodium channel protein type 9 subunit alpha
Type:Protein
Mol. Mass.:226375.97
Organism:Homo sapiens (Human)
Description:Q15858
Residue:1988
BDBM50216644
NameBDBM50216644
Synonyms:CHEMBL445940 | tert-butyl (R)-3-(2-fluorophenyl)-1-((R)-1-isopropyl-2-oxo-2,3,4,5-tetrahydro-1H-benzo[b]azepin-3-ylamino)-1-oxopropan-2-ylcarbamate
TypeSmall organic molecule
Emp. Form.C27H34FN3O4
Mol. Mass.483.575
SMILESCC(C)N1c2ccccc2CC[C@@H](NC(=O)[C@@H](Cc2ccccc2F)NC(=O)OC(C)(C)C)C1=O