Reaction Details
TargetNAD-dependent protein deacetylase sirtuin-1
LigandBDBM50216688
Substrate/Competitorn/a
Meas. Tech.ChEMBL_437198 (CHEMBL906596)
IC50>50000±n/a nM
Citation Outeiro, TFKontopoulos, EAltmann, SMKufareva, IStrathearn, KEAmore, AMVolk, CBMaxwell, MMRochet, JCMcLean, PJYoung, ABAbagyan, RFeany, MBHyman, BTKazantsev, AG Sirtuin 2 inhibitors rescue alpha-synuclein-mediated toxicity in models of Parkinson's disease. Science317:516-9 (2007) 
 
NAD-dependent protein deacetylase sirtuin-1
Name:NAD-dependent protein deacetylase sirtuin-1
Type:Developmental protein; hydrolase
Mol. Mass.:81626.66
Organism:Homo sapiens (Human)
Description:n/a
Residue:747
BDBM50216688
NameBDBM50216688
Synonyms:2-cyano-N-(quinolin-5-yl)-3-(5-(3-(trifluoromethyl)phenyl)furan-2-yl)acrylamide | CHEMBL225797
TypeSmall organic molecule
Emp. Form.C24H14F3N3O2
Mol. Mass.433.3821
SMILESFC(F)(F)c1cccc(c1)-c1ccc(\C=C(/C#N)C(=O)Nc2cccc3ncccc23)o1