Reaction Details
TargetNAD-dependent protein deacetylase sirtuin-3, mitochondrial
LigandBDBM50216691
Substrate/Competitorn/a
Meas. Tech.ChEMBL_437200 (CHEMBL906598)
IC50>50000±n/a nM
Citation Outeiro, TFKontopoulos, EAltmann, SMKufareva, IStrathearn, KEAmore, AMVolk, CBMaxwell, MMRochet, JCMcLean, PJYoung, ABAbagyan, RFeany, MBHyman, BTKazantsev, AG Sirtuin 2 inhibitors rescue alpha-synuclein-mediated toxicity in models of Parkinson's disease. Science317:516-9 (2007) 
 
NAD-dependent protein deacetylase sirtuin-3, mitochondrial
Name:NAD-dependent protein deacetylase sirtuin-3, mitochondrial
Type:Protein
Mol. Mass.:43582.69
Organism:Homo sapiens (Human)
Description:Q9NTG7
Residue:399
BDBM50216691
NameBDBM50216691
Synonyms:3-(5-(2-chlorophenyl)furan-2-yl)-2-cyano-N-(quinolin-5-yl)acrylamide | CHEMBL228175
TypeSmall organic molecule
Emp. Form.C23H14ClN3O2
Mol. Mass.399.829
SMILESClc1ccccc1-c1ccc(\C=C(/C#N)C(=O)Nc2cccc3ncccc23)o1