Reaction Details
TargetMetabotropic glutamate receptor 5
LigandBDBM50084137
Substrate/Competitorn/a
Meas. Tech.ChEMBL_447843 (CHEMBL898093)
IC50 0.2±n/a nM
Citation Milbank, JBKnauer, CSAugelli-Szafran, CESakkab-Tan, ATLin, KKYamagata, KHoffman, JKZhuang, NThomas, JGalatsis, PWendt, JAMickelson, JWSchwarz, RDKinsora, JJLotarski, SMStakich, KGillespie, KKLam, WWMutlib, AE Rational design of 7-arylquinolines as non-competitive metabotropic glutamate receptor subtype 5 antagonists. Bioorg Med Chem Lett17:4415-8 (2007) 
 
Metabotropic glutamate receptor 5
Name:Metabotropic glutamate receptor 5
Type:Enzyme
Mol. Mass.:131900.14
Organism:Rattus norvegicus (Rat)
Description:P31424
Residue:1203
BDBM50084137
NameBDBM50084137
Synonyms:2-Methyl-6-(phenylethynyl)pyridine 2-Methyl-6-phenylethynyl-pyridine(MPEP) 2-methyl-6-(phenyl-ethynyl)pyridine 6-methyl-2-(2-phenylethynyl)pyridine CHEMBL66654 US10618900, No. MPEP | [3H]-2-methyl-6-(phenylethynyl)-pyridine
TypeSmall organic molecule
Emp. Form.C14H11N
Mol. Mass.193.2438
SMILESCc1cccc(n1)C#Cc1ccccc1