Reaction Details
TargetMetabotropic glutamate receptor 5
LigandBDBM50216762
Substrate/Competitorn/a
Meas. Tech.ChEMBL_447843 (CHEMBL898093)
IC50 1.4±n/a nM
Citation Milbank, JBKnauer, CSAugelli-Szafran, CESakkab-Tan, ATLin, KKYamagata, KHoffman, JKZhuang, NThomas, JGalatsis, PWendt, JAMickelson, JWSchwarz, RDKinsora, JJLotarski, SMStakich, KGillespie, KKLam, WWMutlib, AE Rational design of 7-arylquinolines as non-competitive metabotropic glutamate receptor subtype 5 antagonists. Bioorg Med Chem Lett17:4415-8 (2007) 
 
Metabotropic glutamate receptor 5
Name:Metabotropic glutamate receptor 5
Type:Enzyme
Mol. Mass.:131900.14
Organism:Rattus norvegicus (Rat)
Description:P31424
Residue:1203
BDBM50216762
NameBDBM50216762
Synonyms:3-chloro-5-(2-methylquinolin-7-yl)benzonitrile | CHEMBL396135
TypeSmall organic molecule
Emp. Form.C17H11ClN2
Mol. Mass.278.736
SMILESCc1ccc2ccc(cc2n1)-c1cc(Cl)cc(c1)C#N