Reaction Details
TargetBone morphogenetic protein 1
LigandBDBM50216791
Substrate/Competitorn/a
Meas. Tech.ChEMBL_440136 (CHEMBL890447)
IC50 19±n/a nM
Citation Fish, PVAllan, GABailey, SBlagg, JButt, RCollis, MGGreiling, DJames, KKendall, JMcElroy, AMcCleverty, DReed, CWebster, RWhitlock, GA Potent and selective nonpeptidic inhibitors of procollagen C-proteinase. J Med Chem50:3442-56 (2007) 
 
Bone morphogenetic protein 1
Name:Bone morphogenetic protein 1
Type:PROTEIN
Mol. Mass.:111254.03
Organism:Homo sapiens (Human)
Description:ChEMBL_518962
Residue:986
BDBM50216791
NameBDBM50216791
Synonyms:(3R)-3-{3-[(acetylamino)methyl]-1,2,4-oxadiazol-5-yl}-6-cyclohexyl-Nhydroxyhexanamide | CHEMBL390930
TypeSmall organic molecule
Emp. Form.C17H28N4O4
Mol. Mass.352.4286
SMILESCC(=O)NCc1noc(n1)[C@H](CCCC1CCCCC1)CC(=O)NO