Reaction Details
TargetBone morphogenetic protein 1
LigandBDBM50216807
Substrate/Competitorn/a
Meas. Tech.ChEMBL_440136 (CHEMBL890447)
IC50 1.8±n/a nM
Citation Fish, PVAllan, GABailey, SBlagg, JButt, RCollis, MGGreiling, DJames, KKendall, JMcElroy, AMcCleverty, DReed, CWebster, RWhitlock, GA Potent and selective nonpeptidic inhibitors of procollagen C-proteinase. J Med Chem50:3442-56 (2007) 
 
Bone morphogenetic protein 1
Name:Bone morphogenetic protein 1
Type:PROTEIN
Mol. Mass.:111254.03
Organism:Homo sapiens (Human)
Description:ChEMBL_518962
Residue:986
BDBM50216807
NameBDBM50216807
Synonyms:(3R)-6-cyclohexyl-3-[3-({[(3,4-dimethoxyphenyl)sulfonyl]-amino}carbonyl)-1,2,4-oxadiazol-5-yl]-N-hydroxyhexanamide | CHEMBL389491
TypeSmall organic molecule
Emp. Form.C23H32N4O8S
Mol. Mass.524.587
SMILESCOc1ccc(cc1OC)S(=O)(=O)NC(=O)c1noc(n1)[C@H](CCCC1CCCCC1)CC(=O)NO