Reaction Details
TargetBone morphogenetic protein 1
LigandBDBM50216809
Substrate/Competitorn/a
Meas. Tech.ChEMBL_440136 (CHEMBL890447)
IC50 14±n/a nM
Citation Fish, PVAllan, GABailey, SBlagg, JButt, RCollis, MGGreiling, DJames, KKendall, JMcElroy, AMcCleverty, DReed, CWebster, RWhitlock, GA Potent and selective nonpeptidic inhibitors of procollagen C-proteinase. J Med Chem50:3442-56 (2007) 
 
Bone morphogenetic protein 1
Name:Bone morphogenetic protein 1
Type:PROTEIN
Mol. Mass.:111254.03
Organism:Homo sapiens (Human)
Description:ChEMBL_518962
Residue:986
BDBM50216809
NameBDBM50216809
Synonyms:(3R)-6-cyclohexyl-N-hydroxy-3-[3-(5-pyrimidinyl)-1,2,4-oxadiazol-5-yl]hexanamide | CHEMBL226800
TypeSmall organic molecule
Emp. Form.C18H25N5O3
Mol. Mass.359.4228
SMILESONC(=O)C[C@@H](CCCC1CCCCC1)c1nc(no1)-c1cncnc1