Reaction Details
TargetBone morphogenetic protein 1
LigandBDBM50216827
Substrate/Competitorn/a
Meas. Tech.ChEMBL_440136 (CHEMBL890447)
IC50 20±n/a nM
Citation Fish, PVAllan, GABailey, SBlagg, JButt, RCollis, MGGreiling, DJames, KKendall, JMcElroy, AMcCleverty, DReed, CWebster, RWhitlock, GA Potent and selective nonpeptidic inhibitors of procollagen C-proteinase. J Med Chem50:3442-56 (2007) 
 
Bone morphogenetic protein 1
Name:Bone morphogenetic protein 1
Type:PROTEIN
Mol. Mass.:111254.03
Organism:Homo sapiens (Human)
Description:ChEMBL_518962
Residue:986
BDBM50216827
NameBDBM50216827
Synonyms:(3R)-6-cyclohexyl-N-hydroxy-3-(3-{2-[(methylsulfonyl)amino]ethyl}-1,2,4-oxadiazol-5-yl)hexanamide | CHEMBL427430
TypeSmall organic molecule
Emp. Form.C18H33N5O5S
Mol. Mass.431.55
SMILESCS(=O)(=O)NCCNCc1noc(n1)[C@H](CCCC1CCCCC1)CC(=O)NO