Reaction Details
TargetBone morphogenetic protein 1
LigandBDBM50216830
Substrate/Competitorn/a
Meas. Tech.ChEMBL_440136 (CHEMBL890447)
IC50 6±n/a nM
Citation Fish, PVAllan, GABailey, SBlagg, JButt, RCollis, MGGreiling, DJames, KKendall, JMcElroy, AMcCleverty, DReed, CWebster, RWhitlock, GA Potent and selective nonpeptidic inhibitors of procollagen C-proteinase. J Med Chem50:3442-56 (2007) 
 
Bone morphogenetic protein 1
Name:Bone morphogenetic protein 1
Type:PROTEIN
Mol. Mass.:111254.03
Organism:Homo sapiens (Human)
Description:ChEMBL_518962
Residue:986
BDBM50216830
NameBDBM50216830
Synonyms:(3R)-3-{3-[(cyclobutylamino)methyl]-1,2,4-oxadiazol-5-yl}-6-cyclohexyl-Nhydroxyhexanamide | CHEMBL229814
TypeSmall organic molecule
Emp. Form.C19H32N4O3
Mol. Mass.364.4824
SMILESONC(=O)C[C@@H](CCCC1CCCCC1)c1nc(CNC2CCC2)no1