Reaction Details
TargetBone morphogenetic protein 1
LigandBDBM50216817
Substrate/Competitorn/a
Meas. Tech.ChEMBL_440136 (CHEMBL890447)
IC50 7±n/a nM
Citation Fish, PVAllan, GABailey, SBlagg, JButt, RCollis, MGGreiling, DJames, KKendall, JMcElroy, AMcCleverty, DReed, CWebster, RWhitlock, GA Potent and selective nonpeptidic inhibitors of procollagen C-proteinase. J Med Chem50:3442-56 (2007) 
 
Bone morphogenetic protein 1
Name:Bone morphogenetic protein 1
Type:PROTEIN
Mol. Mass.:111254.03
Organism:Homo sapiens (Human)
Description:ChEMBL_518962
Residue:986
BDBM50216817
NameBDBM50216817
Synonyms:(3R)-6-cyclohexyl-N-hydroxy-3-(3-{[(phenylsulfonyl)amino]carbonyl}-1,2,4-oxadiazol-5-yl)hexanamide | CHEMBL439012
TypeSmall organic molecule
Emp. Form.C21H28N4O6S
Mol. Mass.464.535
SMILESONC(=O)C[C@@H](CCCC1CCCCC1)c1nc(no1)C(=O)NS(=O)(=O)c1ccccc1