Reaction Details
TargetBone morphogenetic protein 1
LigandBDBM50216851
Substrate/Competitorn/a
Meas. Tech.ChEMBL_440136 (CHEMBL890447)
IC50 17±n/a nM
Citation Fish, PVAllan, GABailey, SBlagg, JButt, RCollis, MGGreiling, DJames, KKendall, JMcElroy, AMcCleverty, DReed, CWebster, RWhitlock, GA Potent and selective nonpeptidic inhibitors of procollagen C-proteinase. J Med Chem50:3442-56 (2007) 
 
Bone morphogenetic protein 1
Name:Bone morphogenetic protein 1
Type:PROTEIN
Mol. Mass.:111254.03
Organism:Homo sapiens (Human)
Description:ChEMBL_518962
Residue:986
BDBM50216851
NameBDBM50216851
Synonyms:5-(5-{(1R)-4-cyclohexyl-1-[2-(hydroxyamino)-2-oxoethyl]butyl}-1,2,4-oxadiazol-3-yl)nicotinic acid | CHEMBL226903
TypeSmall organic molecule
Emp. Form.C20H26N4O5
Mol. Mass.402.4442
SMILESONC(=O)C[C@@H](CCCC1CCCCC1)c1nc(no1)-c1cncc(c1)C(O)=O