Reaction Details
TargetProtein kinase C delta type
LigandBDBM50216857
Substrate/Competitorn/a
Meas. Tech.ChEMBL_440176 (CHEMBL890490)
Ki 0.9±n/a nM
Citation Choi, YPu, YPeach, MLKang, JHLewin, NESigano, DMGarfield, SHBlumberg, PMMarquez, VE Conformationally constrained analogues of diacylglycerol (DAG). 28. DAG-dioxolanones reveal a new additional interaction site in the C1b domain of PKC delta. J Med Chem50:3465-81 (2007) 
 
Protein kinase C delta type
Name:Protein kinase C delta type
Type:PROTEIN
Mol. Mass.:77554.99
Organism:Mus musculus
Description:ChEMBL_1351519
Residue:674
BDBM50216857
NameBDBM50216857
Synonyms:(2-(hydroxymethyl)-4-(3-methylbutylidene)-5-oxo-tetrahydrofuran-2-yl)methyl 3-isobutyl-5-methylhexanoate {2-(hydroxymethyl)-5-[5-methyl-3-(2-methylpropyl)hexylidene]-4-oxo-1,3-dioxolan-2-yl}methyl 3-methylbutanoate
TypeSmall organic molecule
Emp. Form.C21H36O6
Mol. Mass.384.5069
SMILESCC(C)C\C=C1\OC(CO)(COC(=O)CC(CC(C)C)CC(C)C)OC1=O