Reaction Details
TargetProtein kinase C delta type
LigandBDBM50216860
Substrate/Competitorn/a
Meas. Tech.ChEMBL_440176 (CHEMBL890490)
Ki 2.13±n/a nM
Citation Choi, YPu, YPeach, MLKang, JHLewin, NESigano, DMGarfield, SHBlumberg, PMMarquez, VE Conformationally constrained analogues of diacylglycerol (DAG). 28. DAG-dioxolanones reveal a new additional interaction site in the C1b domain of PKC delta. J Med Chem50:3465-81 (2007) 
 
Protein kinase C delta type
Name:Protein kinase C delta type
Type:PROTEIN
Mol. Mass.:77554.99
Organism:Mus musculus
Description:ChEMBL_1351519
Residue:674
BDBM50216860
NameBDBM50216860
Synonyms:CHEMBL230048 | Z-[2-(Hydroxymethyl)-4-(3-methylbutylidene)-5-oxo-2-(2,3-dihydrofuryl)]methyl 5-Methyl-3-(2-methylpropyl)hexanoate
TypeSmall organic molecule
Emp. Form.C22H38O5
Mol. Mass.382.5341
SMILESCC(C)C\C=C1\CC(CO)(COC(=O)CC(CC(C)C)CC(C)C)OC1=O