Reaction Details
Target11-beta-hydroxysteroid dehydrogenase 1
LigandBDBM50216904
Substrate/Competitorn/a
Meas. Tech.ChEMBL_448530 (CHEMBL897679)
Ki 6±n/a nM
Citation Sutin, LAndersson, SBergquist, LCastro, VMDanielsson, EJames, SHenriksson, MJohansson, LKaiser, CFlyrén, KWilliams, M Oxazolones as potent inhibitors of 11beta-hydroxysteroid dehydrogenase type 1. Bioorg Med Chem Lett17:4837-40 (2007) 
 
11-beta-hydroxysteroid dehydrogenase 1
Name:11-beta-hydroxysteroid dehydrogenase 1
Type:Enzyme
Mol. Mass.:32409.16
Organism:Homo sapiens (Human)
Description:P28845
Residue:292
BDBM50216904
NameBDBM50216904
Synonyms:2-(adamantan-1-ylamino)-5-isopropyl-5-methyl-oxazol-4-one | CHEMBL391188
TypeSmall organic molecule
Emp. Form.C17H26N2O2
Mol. Mass.290.4005
SMILESCC(C)C1(C)OC(NC23CC4CC(CC(C4)C2)C3)=NC1=O