Reaction Details
TargetKappa-type opioid receptor
LigandBDBM50216982
Substrate/Competitorn/a
Meas. Tech.ChEMBL_448537 (CHEMBL896541)
Ki 230±n/a nM
Citation Wu, HSmith, TAHuang, HWang, JBDeschamps, JRCoop, A Functionalization of the 6,14-bridge of the orvinols. Part 3: preparation and pharmacological evaluation of 18- and 19-hydroxyl substituted orvinols. Bioorg Med Chem Lett17:4829-31 (2007) 
 
Kappa-type opioid receptor
Name:Kappa-type opioid receptor
Type:G Protein-Coupled Receptor (GPCR)
Mol. Mass.:42648.76
Organism:Homo sapiens (Human)
Description:P41145
Residue:380
BDBM50216982
NameBDBM50216982
Synonyms:CHEMBL235239 UMB97
TypeSmall organic molecule
Emp. Form.C22H29NO5
Mol. Mass.387.4694
SMILESCO[C@]12CC(O)[C@@]3(C[C@@H]1[C@@H](C)O)[C@H]1Cc4ccc(O)c5O[C@@H]2[C@]3(CCN1C)c45