Reaction Details
TargetCannabinoid receptor 2
LigandBDBM50217071
Substrate/Competitorn/a
Meas. Tech.ChEMBL_440457 (CHEMBL890772)
Ki 4500±n/a nM
Citation Minutolo, FCascio, MGCarboni, IBisogno, TProta, GBertini, SDigiacomo, MBifulco, MDi Marzo, VMacchia, M Metabolically labile cannabinoid esters: a 'soft drug' approach for the development of cannabinoid-based therapeutic drugs. Bioorg Med Chem Lett17:4878-81 (2007) 
 
Cannabinoid receptor 2
Name:Cannabinoid receptor 2
Type:G Protein-Coupled Receptor (GPCR)
Mol. Mass.:39690.94
Organism:Homo sapiens (Human)
Description:P34972
Residue:360
BDBM50217071
NameBDBM50217071
Synonyms:2,6-dihydroxy-3',5'-dimethyl-biphenyl-4-carboxylic acid methyl ester | CHEMBL228373
TypeSmall organic molecule
Emp. Form.C16H16O4
Mol. Mass.272.2958
SMILESCOC(=O)c1cc(O)c(c(O)c1)-c1cc(C)cc(C)c1