Reaction Details
TargetCannabinoid receptor 1
LigandBDBM50217080
Substrate/Competitorn/a
Meas. Tech.ChEMBL_440456 (CHEMBL890771)
Ki>10000±n/a nM
Citation Minutolo, FCascio, MGCarboni, IBisogno, TProta, GBertini, SDigiacomo, MBifulco, MDi Marzo, VMacchia, M Metabolically labile cannabinoid esters: a 'soft drug' approach for the development of cannabinoid-based therapeutic drugs. Bioorg Med Chem Lett17:4878-81 (2007) 
 
Cannabinoid receptor 1
Name:Cannabinoid receptor 1
Type:G Protein-Coupled Receptor (GPCR)
Mol. Mass.:52868.96
Organism:Homo sapiens (Human)
Description:P21554
Residue:472
BDBM50217080
NameBDBM50217080
Synonyms:2,6-dihydroxy-biphenyl-4-carboxylic acid pentyl ester | CHEMBL228852
TypeSmall organic molecule
Emp. Form.C18H20O4
Mol. Mass.300.349
SMILESCCCCCOC(=O)c1cc(O)c(c(O)c1)-c1ccccc1