Reaction Details
TargetReceptor-type tyrosine-protein kinase FLT3
LigandBDBM50217355
Substrate/Competitorn/a
Meas. Tech.ChEMBL_448611 (CHEMBL897762)
IC50 150±n/a nM
Citation Gaul, MDXu, GKirkpatrick, JOtt, HBaumann, CA 4-Amino-6-piperazin-1-yl-pyrimidine-5-carbaldehyde oximes as potent FLT-3 inhibitors. Bioorg Med Chem Lett17:4861-5 (2007) 
 
Receptor-type tyrosine-protein kinase FLT3
Name:Receptor-type tyrosine-protein kinase FLT3
Type:Enzyme
Mol. Mass.:112888.62
Organism:Homo sapiens (Human)
Description:P36888
Residue:993
BDBM50217355
NameBDBM50217355
Synonyms:(E)-4-(6-amino-5-((2-(methylsulfonamido)ethoxyimino)methyl)pyrimidin-4-yl)-N-(4-(pyrrolidin-1-yl)phenyl)piperazine-1-carboxamide | CHEMBL237338
TypeSmall organic molecule
Emp. Form.C23H33N9O4S
Mol. Mass.531.631
SMILESCS(=O)(=O)NCCO\N=C\c1c(N)ncnc1N1CCN(CC1)C(=O)Nc1ccc(cc1)N1CCCC1