Reaction Details
TargetReceptor-type tyrosine-protein kinase FLT3
LigandBDBM50217366
Substrate/Competitorn/a
Meas. Tech.ChEMBL_448611 (CHEMBL897762)
IC50 15±n/a nM
Citation Gaul, MDXu, GKirkpatrick, JOtt, HBaumann, CA 4-Amino-6-piperazin-1-yl-pyrimidine-5-carbaldehyde oximes as potent FLT-3 inhibitors. Bioorg Med Chem Lett17:4861-5 (2007) 
 
Receptor-type tyrosine-protein kinase FLT3
Name:Receptor-type tyrosine-protein kinase FLT3
Type:Enzyme
Mol. Mass.:112888.62
Organism:Homo sapiens (Human)
Description:P36888
Residue:993
BDBM50217366
NameBDBM50217366
Synonyms:4-(6-amino-5-((methoxyimino)methyl)pyrimidin-4-yl)-N-(4-isopropylphenyl)piperazine-1-carboxamide | CHEMBL391368
TypeSmall organic molecule
Emp. Form.C20H27N7O2
Mol. Mass.397.4741
SMILESCO\N=C\c1c(N)ncnc1N1CCN(CC1)C(=O)Nc1ccc(cc1)C(C)C