Reaction Details
TargetIntegrin alpha-5/beta-1
LigandBDBM50217426
Substrate/Competitorn/a
Meas. Tech.ChEMBL_444670 (CHEMBL894919)
IC50 0.55±n/a nM
Citation Stragies, ROsterkamp, FZischinsky, GVossmeyer, DKalkhof, HReimer, UZahn, G Design and synthesis of a new class of selective integrin alpha5beta1 antagonists. J Med Chem50:3786-94 (2007) 
 
Integrin alpha-5/beta-1
Name:Integrin alpha-5/beta-1
Type:Enzyme
Mol. Mass.:n/a
Description:n/a
Components:This complex has 2 components.
Component 1
Name:Integrin alpha-5
Synonyms:CD49 antigen-like family member E FNRA Fibronectin receptor subunit alpha ITGA5 Integrin alpha-F | VLA-5
Type:Single-pass type I membrane protein
Mol. Mass.:114523.00
Organism:Homo sapiens (Human)
Description:n/a
Residue:1049
Component 2
Name:Integrin beta-1
Synonyms:CD_antigen=CD29 Fibronectin receptor beta GPIIA ITGB1 MDF2 | MSK12
Type:Enzyme
Mol. Mass.:88400.38
Organism:Homo sapiens (Human)
Description:P05556
Residue:798
BDBM50217426
NameBDBM50217426
Synonyms:2S,3R,5S-3-(2-{1-(3,3-dimethyl-butyryl)-5-[(4-methoxy-pyridin-2-ylamino)-methyl]-pyrrolidin-3-yloxy}-acetylamino)-2-[(1-methyl-cyclohexanecarbonyl)-amino]-propionic acid | CHEMBL241835
TypeSmall organic molecule
Emp. Form.C30H47N5O7
Mol. Mass.589.7235
SMILESCOc1ccnc(NC[C@@H]2C[C@H](CN2C(=O)CC(C)(C)C)OCC(=O)NC[C@H](NC(=O)C2(C)CCCCC2)C(O)=O)c1