Reaction Details
TargetCalcitonin gene-related peptide type 1 receptor/Receptor activity-modifying protein 1
LigandBDBM50217482
Substrate/Competitorn/a
Meas. Tech.ChEMBL_448633 (CHEMBL897783)
Ki>10000±n/a nM
Citation Shaw, AWPaone, DVNguyen, DNStump, CABurgey, CSMosser, SDSalvatore, CARutledge, RZKane, SAKoblan, KSGraham, SLVacca, JPWilliams, TM Caprolactams as potent CGRP receptor antagonists for the treatment of migraine. Bioorg Med Chem Lett17:4795-8 (2007) 
 
Calcitonin gene-related peptide type 1 receptor/Receptor activity-modifying protein 1
Name:Calcitonin gene-related peptide type 1 receptor/Receptor activity-modifying protein 1
Synonyms:Calcitonin-gene-related peptide receptor, CALCRL/RAMP1
Type:n/a
Mol. Mass.:n/a
Description:ASSAY_ID of EBI is 327200
Components:This complex has 2 components.
Component 1
Name:Calcitonin gene-related peptide type 1 receptor
Type:Enzyme Catalytic Domain
Mol. Mass.:52980.45
Organism:Homo sapiens (Human)
Description:Q16602
Residue:461
Component 2
Name:Receptor activity-modifying protein 1
Synonyms:Calcitonin-gene-related peptide receptor, CALCRL/RAMP1 RAMP1_HUMAN
Type:PROTEIN
Mol. Mass.:16992.80
Organism:Homo sapiens (Human)
Description:EBI_100673
Residue:148
BDBM50217482
NameBDBM50217482
Synonyms:CHEMBL236516 | tert-butyl 2-((3S,7S)-2-oxo-3-(4-(2-oxo-1,2-dihydroquinazolin-3(4H)-yl)piperidine-1-carboxamido)-7-phenylazepan-1-yl)acetate
TypeSmall organic molecule
Emp. Form.C32H41N5O5
Mol. Mass.575.6984
SMILESCC(C)(C)OC(=O)CN1[C@@H](CCC[C@H](NC(=O)N2CCC(CC2)N2Cc3ccccc3NC2=O)C1=O)c1ccccc1