Reaction Details
TargetCalcitonin gene-related peptide type 1 receptor/Receptor activity-modifying protein 1
LigandBDBM50217488
Substrate/Competitorn/a
Meas. Tech.ChEMBL_448633 (CHEMBL897783)
Ki 29±n/a nM
Citation Shaw, AWPaone, DVNguyen, DNStump, CABurgey, CSMosser, SDSalvatore, CARutledge, RZKane, SAKoblan, KSGraham, SLVacca, JPWilliams, TM Caprolactams as potent CGRP receptor antagonists for the treatment of migraine. Bioorg Med Chem Lett17:4795-8 (2007) 
 
Calcitonin gene-related peptide type 1 receptor/Receptor activity-modifying protein 1
Name:Calcitonin gene-related peptide type 1 receptor/Receptor activity-modifying protein 1
Synonyms:Calcitonin-gene-related peptide receptor, CALCRL/RAMP1
Type:n/a
Mol. Mass.:n/a
Description:ASSAY_ID of EBI is 327200
Components:This complex has 2 components.
Component 1
Name:Calcitonin gene-related peptide type 1 receptor
Type:Enzyme Catalytic Domain
Mol. Mass.:52980.45
Organism:Homo sapiens (Human)
Description:Q16602
Residue:461
Component 2
Name:Receptor activity-modifying protein 1
Synonyms:Calcitonin-gene-related peptide receptor, CALCRL/RAMP1 RAMP1_HUMAN
Type:PROTEIN
Mol. Mass.:16992.80
Organism:Homo sapiens (Human)
Description:EBI_100673
Residue:148
BDBM50217488
NameBDBM50217488
Synonyms:CHEMBL392132 | N-((3R,6S)-1-(cyclopropylmethyl)-2-oxo-6-phenylazepan-3-yl)-4-(5-oxo-3-phenyl-4,5-dihydro-1,2,4-triazol-1-yl)piperidine-1-carboxamide
TypeSmall organic molecule
Emp. Form.C30H36N6O3
Mol. Mass.528.6452
SMILESO=C(N[C@@H]1CC[C@H](CN(CC2CC2)C1=O)c1ccccc1)N1CCC(CC1)n1nc([nH]c1=O)-c1ccccc1