Reaction Details
TargetSodium-dependent serotonin transporter
LigandBDBM50217572
Substrate/Competitorn/a
Meas. Tech.ChEMBL_448652 (CHEMBL897803)
Ki 0.7±n/a nM
Citation Letavic, MAStocking, EMBarbier, AJBonaventure, PBoggs, JDLord, BMiller, KLWilson, SJCarruthers, NI Benzylamine histamine H(3) antagonists and serotonin reuptake inhibitors. Bioorg Med Chem Lett17:4799-803 (2007) 
 
Sodium-dependent serotonin transporter
Name:Sodium-dependent serotonin transporter
Type:Multi-pass membrane protein
Mol. Mass.:70322.51
Organism:Homo sapiens (Human)
Description:P31645
Residue:630
BDBM50217572
NameBDBM50217572
Synonyms:CHEMBL393036 | N-methyl(2-(4-(methylthio)phenoxy)-5-(4-(piperidin-1-yl)but-1-ynyl)phenyl)methanamine
TypeSmall organic molecule
Emp. Form.C24H30N2OS
Mol. Mass.394.573
SMILESCNCc1cc(ccc1Oc1ccc(SC)cc1)C#CCCN1CCCCC1