Reaction Details
TargetSodium-dependent serotonin transporter
LigandBDBM50217576
Substrate/Competitorn/a
Meas. Tech.ChEMBL_448651 (CHEMBL897802)
Ki 0.9±n/a nM
Citation Letavic, MAStocking, EMBarbier, AJBonaventure, PBoggs, JDLord, BMiller, KLWilson, SJCarruthers, NI Benzylamine histamine H(3) antagonists and serotonin reuptake inhibitors. Bioorg Med Chem Lett17:4799-803 (2007) 
 
Sodium-dependent serotonin transporter
Name:Sodium-dependent serotonin transporter
Type:Multi-pass membrane protein
Mol. Mass.:70168.43
Organism:Rattus norvegicus (rat)
Description:P31652
Residue:630
BDBM50217576
NameBDBM50217576
Synonyms:CHEMBL236046 N-methyl(2-(4-(methylthio)phenoxy)-5-(4-morpholinobut-1-ynyl)phenyl)methanamine
TypeSmall organic molecule
Emp. Form.C23H28N2O2S
Mol. Mass.396.546
SMILESCNCc1cc(ccc1Oc1ccc(SC)cc1)C#CCCN1CCOCC1