Reaction Details
TargetFibroblast growth factor receptor 1
LigandBDBM4811
Substrate/Competitorn/a
Meas. Tech.ChEMBL_440629 (CHEMBL889723)
IC50>50000±n/a nM
Citation Kammasud, NBoonyarat, CTsunoda, SSakurai, HSaiki, IGrierson, DSVajragupta, O Novel inhibitor for fibroblast growth factor receptor tyrosine kinase. Bioorg Med Chem Lett17:4812-8 (2007) 
 
Fibroblast growth factor receptor 1
Name:Fibroblast growth factor receptor 1
Type:Receptor
Mol. Mass.:91861.70
Organism:Homo sapiens (Human)
Description:P11362
Residue:822
BDBM4811
NameBDBM4811
Synonyms:(Z)-3-[2,4-dimethyl-5-(2-oxo-1,2-dihydro-indol-3-ylidenemethyl)-1H-pyrrol-3-yl]-propionic acid CHEMBL274654 | SU6668
TypeSmall organic molecule
Emp. Form.C18H18N2O3
Mol. Mass.310.3471
SMILESCc1[nH]c(\C=C2/C(=O)Nc3ccccc23)c(C)c1CCC(O)=O