Reaction Details
TargetFibroblast growth factor receptor 1
LigandBDBM4901
Substrate/Competitorn/a
Meas. Tech.ChEMBL_440629 (CHEMBL889723)
IC50 17900±n/a nM
Citation Kammasud, NBoonyarat, CTsunoda, SSakurai, HSaiki, IGrierson, DSVajragupta, O Novel inhibitor for fibroblast growth factor receptor tyrosine kinase. Bioorg Med Chem Lett17:4812-8 (2007) 
 
Fibroblast growth factor receptor 1
Name:Fibroblast growth factor receptor 1
Type:Receptor
Mol. Mass.:91861.70
Organism:Homo sapiens (Human)
Description:P11362
Residue:822
BDBM4901
NameBDBM4901
Synonyms:3-(5-{[(3Z)-6-(3-methoxyphenyl)-2-oxo-2,3-dihydro-1H-indol-3-ylidene]methyl}-2,4-dimethyl-1H-pyrrol-3-yl)propanoic acid CHEMBL358728
TypeSmall organic molecule
Emp. Form.C25H24N2O4
Mol. Mass.416.4691
SMILESCOc1cccc(c1)-c1ccc2\C(=C\c3[nH]c(C)c(CCC(O)=O)c3C)C(=O)Nc2c1