Reaction Details
TargetPeroxisome proliferator-activated receptor gamma
LigandBDBM19264
Substrate/Competitorn/a
Meas. Tech.ChEMBL_448678 (CHEMBL897828)
Kd 1.1E5±n/a nM
Citation Ubukata, MTakamori, HOhashi, MMitsuhashi, SYamashita, KAsada, TNakajima, NMatsuura, NTsuruga, MTaki, KMagae, J Mycophenolic acid as a latent agonist of PPARgamma. Bioorg Med Chem Lett17:4767-70 (2007) 
 
Peroxisome proliferator-activated receptor gamma
Name:Peroxisome proliferator-activated receptor gamma
Type:Nuclear Receptor
Mol. Mass.:57613.46
Organism:Homo sapiens (Human)
Description:P37231
Residue:505
BDBM19264
NameBDBM19264
Synonyms:(4E)-6-(4-hydroxy-6-methoxy-7-methyl-3-oxo-1,3-dihydro-2-benzofuran-5-yl)-4-methylhex-4-enoic acid CHEMBL866 Mycophenolic Acid (MPA) | Myfortic
TypeSmall organic molecule
Emp. Form.C17H20O6
Mol. Mass.320.3371
SMILESCOc1c(C)c2COC(=O)c2c(O)c1C\C=C(/C)CCC(O)=O